{"text_format":"1","workbook":"xlsx","n_sheets":8,"sheets":["Indeks","Introduktion","Spørgeskema","Requirements_hidden","Questionnaire","Hjælp","Level of Conformance","Requirements"],"not_rendered":{"charts":0,"images":0,"macros":1,"external_links":0,"defined_names":22,"comments":0,"pivot_tables":0},"unopened":[],"bounds":{"document_bytes":16777216,"sheet_cells":100000,"rows_first":2000,"rows_last":500,"rows_between":2000,"halvings":0,"cell_chars":16384,"cell_head_chars":4096},"cells_cut":0,"cells_raw":0,"read":"whole","date_system":"1900"}

{"sheet":"Indeks","index":0,"n_rows":4,"n_cols":1,"rows_kept":4,"cut":false,"hidden":false,"merged":[]}
["Projektmappen har fire ark: det første ark fungerer som indeks, det andet ark er oversigt over WCAG-screeningsværktøjet, og det tredje og fjerde ark er **WCAG-overensstemmelsesspørgeskemaet**. Links til de andre tre ark findes nedenfor."]
["Introduktion"]
["Spørgeskema"]
["Hjælp"]

{"sheet":"Introduktion","index":1,"n_rows":2,"n_cols":1,"rows_kept":2,"cut":false,"hidden":false,"merged":[]}
["Regnearket indeholder en **oversigt over WCAG-screeningsværktøjet**."]
["Formål\nDette screeningsværktøj er designet til at hjælpe dig med at identificere og sortere relevante WCAG-krav, som du bør stille overfor leverandører. Ved at besvare spørgsmål i et spørgeskema, får du en oversigt over de WCAG-krav, der er mest relevante for din specifikke situation.\n\nSådan Bruger Du Værktøjet\nTrin 1: Besvar Spørgeskemaet\n - Åbn spørgeskemaet: Find fanen med spørgeskemaet i Excel-arket.\n- Besvar spørgsmålene: Gå igennem hvert spørgsmål og besvar dem så præcist som muligt. \nSpørgsmålene er designet til at afdække dine behov og krav til webtilgængelighed.\n\nTrin 2: Generer Oversigt over WCAG-Krav\n- Automatisk sortering: Når du har besvaret spørgeskemaet, vil værktøjet automatisk sortere og generere en liste over relevante WCAG-krav ved at klikke på \"Generer Kravsoversigt\"\n- Se oversigten: Gå til fanen med oversigten over WCAG-krav. Her vil du finde en liste over de krav, der er relevante baseret på dine svar.\n\nVigtige Funktioner\nInteraktiv Spørgeskema: Spørgeskemaet er interaktivt og dynamisk, hvilket betyder, at dine svar direkte påvirker hvilke WCAG-krav der vises i oversigten.\n\nTips til Brug\nVær præcis: Jo mere præcise dine svar er, desto mere nøjagtig vil oversigten over WCAG-krav være.\nGennemgå kravene: Tag dig tid til at gennemgå de genererede WCAG-krav og forstå deres betydning og relevans.\nKommuniker med leverandører: Brug den genererede liste som grundlag for at stille klare og specifikke krav til dine leverandører.\n\nHjælp\nHjælp-fane: Hvis du har udfordringer med at besvare spørgsmålene, kan du finde uddybende beskrivelser og vejledninger i fanen kaldet \"Hjælp\". Denne fane indeholder detaljerede forklaringer, der kan hjælpe dig med at forstå og besvare hvert spørgsmål korrekt."]

{"sheet":"Spørgeskema","index":2,"n_rows":23,"n_cols":3,"rows_kept":23,"cut":false,"hidden":false,"merged":[]}
["Regnearket indeholder **WCAG-overensstemmelsesspørgeskemaet**."]
["Nr. ","Spørgsmål","Besvarelse"]
[1,"Hvilket niveau af overholdelse af WCAG-krav skal imødekommes?\n*AA = Adresserer de mest almindelige barrierer. Sigter mod at gøre indhold tilgængeligt for et bredere publikum. og **AAA (højeste niveau) = Højeste niveau af tilgængelighed. Sikrer, at indhold er tilgængeligt for det størst mulige antal personer, herunder personer med alvorlige handicap."]
[2,"Bruger løsningen videoindhold?"]
[3,"Bruger løsningen lydindhold?"]
[4,"Inkluderer løsningen live streaming eller webcasts?"]
[5,"Indeholder løsningen billeder med tekst indhold?"]
[6,"Indeholder løsningen formularer, som brugerne skal udfylde?"]
[7,"Benytter løsningen tekst?"]
[8,"Benytter løsningen ikke-tekstindhold (f.eks. billeder, ikoner)?"]
[9,"Benytter løsningen farve til at formidle information?"]
[10,"Kan løsningen bruges på mobile enheder (Smartphones og tablets)?"]
[11,"Har løsningen tidsbegrænsninger for brugerhandlinger?"]
[12,"Indeholder løsningen indhold, der bevæger sig, blinker eller opdateres automatisk?"]
[13,"Indeholder løsningen indehold som kræver instruktioner?"]
{"$rows_left_out":9}
{"sheet":"Requirements_hidden","index":3,"n_rows":79,"n_cols":10,"rows_kept":79,"cut":false,"hidden":true,"merged":[]}
["Hide/unhide","Principper","Retningslinjer","Nr.","Succeskriterier","Beskrivelse","Level ","Mål","Hvad skal man gøre","Hvorfor det er vigtigt"]
[{"$f":"IF(LEN(Requirements_hidden!G2)>LEN(Question1),\"Hide\",\nIF(AND(COUNTIF(Questionnaire!$C$2:$M$43,Requirements_hidden!D2)>0,COUNTIF(Questionnaire!$C$2:$M$43,Requirements_hidden!D2)=COUNTIF(Questionnaire!$O$2:$Z$43,Requirements_hidden!D2)),\"Hide\",\"Unhide\"))","v":"Hide"},"Opfattelig","Tekstbaserede alternativer","1.1.1","Ikke-tekstbaseret indhold","Alt ikke-tekstbaseret indhold, der præsenteres for brugeren, har tilknyttet et tekstbaseret alternativ, som har samme formål, undtaget nedenstående situationer.","A","Ikke-tekstinformation er tilgængelig for flere mennesker.","Opret et tekstalternativ til visuelt og auditivt indhold.","Folk, der ikke fuldt ud kan se eller høre indhold, kan forstå det."]
[{"$f":"IF(LEN(Requirements_hidden!G3)>LEN(Question1),\"Hide\",\nIF(AND(COUNTIF(Questionnaire!$C$2:$M$43,Requirements_hidden!D3)>0,COUNTIF(Questionnaire!$C$2:$M$43,Requirements_hidden!D3)=COUNTIF(Questionnaire!$O$2:$Z$43,Requirements_hidden!D3)),\"Hide\",\"Unhide\"))","v":"Hide"},"Opfattelig","Tidsafhængige medier","1.2.1","Rent lydindhold (audio only) og rent videoindhold (video only) (forudindspillet)","For forudindspillet rent lydindhold og forudindspillet rent videoindhold gælder følgende, undtagen når video eller lyd udgør et mediealternativ til tekst og klart er markeret som sådan","A","Lyd- og videoindhold kan forstås af flere mennesker.","Giv et alternativ, når indhold kun kan opfattes med én sans.","Folk, der ikke fuldt ud kan se eller høre indhold, kan forstå det."]
[{"$f":"IF(LEN(Requirements_hidden!G4)>LEN(Question1),\"Hide\",\nIF(AND(COUNTIF(Questionnaire!$C$2:$M$43,Requirements_hidden!D4)>0,COUNTIF(Questionnaire!$C$2:$M$43,Requirements_hidden!D4)=COUNTIF(Questionnaire!$O$2:$Z$43,Requirements_hidden!D4)),\"Hide\",\"Unhide\"))","v":"Hide"},"Opfattelig","Tidsafhængige medier","1.2.2","Undertekster (forudindspillet)","Der skal leveres undertekster til alt forudindspillet lydindhold i synkroniserede medier, undtaget når medier fungerer som mediealternativ til tekst og er klart markeret som sådan.","A","Videoer kan afspilles med undertekster.","Giv synkroniseret tekst til lydindhold i eksisterende videoer.","Døve eller hørehæmmede kan forstå lyd i videoer."]
[{"$f":"IF(LEN(Requirements_hidden!G5)>LEN(Question1),\"Hide\",\nIF(AND(COUNTIF(Questionnaire!$C$2:$M$43,Requirements_hidden!D5)>0,COUNTIF(Questionnaire!$C$2:$M$43,Requirements_hidden!D5)=COUNTIF(Questionnaire!$O$2:$Z$43,Requirements_hidden!D5)),\"Hide\",\"Unhide\"))","v":"Hide"},"Opfattelig","Tidsafhængige medier","1.2.3","Synstolkning eller mediealternativ (forudindspillet)","Der skal leveres et alternativ til tidsafhængige medier eller synstolkning af forudindspillet/ videoindhold i synkroniserede medier, undtagen når medierne er mediealternativ til tekst og er klart markeret som sådan.","A","Forudindspillede videoer kan forstås af flere mennesker.","Giv en beskrivelse af det visuelle indhold i videoer.","Personer, der er blinde, eller som ikke kan forstå det visuelle indhold, kan få det beskrevet."]
[{"$f":"IF(LEN(Requirements_hidden!G6)>LEN(Question1),\"Hide\",\nIF(AND(COUNTIF(Questionnaire!$C$2:$M$43,Requirements_hidden!D6)>0,COUNTIF(Questionnaire!$C$2:$M$43,Requirements_hidden!D6)=COUNTIF(Questionnaire!$O$2:$Z$43,Requirements_hidden!D6)),\"Hide\",\"Unhide\"))","v":"Hide"},"Opfattelig","Tidsafhængige medier","1.2.4","Undertekster (direkte)","Der skal leveres undertekster til alt direkte udsendt lydindhold i synkroniserede medier","AA","Livevideoer har undertekster.","Giv synkroniseret tekst til lydindhold i realtidsvideoer.","Døve eller hørehæmmede kan forstå lyd i videoindhold i realtid."]
[{"$f":"IF(LEN(Requirements_hidden!G7)>LEN(Question1),\"Hide\",\nIF(AND(COUNTIF(Questionnaire!$C$2:$M$43,Requirements_hidden!D7)>0,COUNTIF(Questionnaire!$C$2:$M$43,Requirements_hidden!D7)=COUNTIF(Questionnaire!$O$2:$Z$43,Requirements_hidden!D7)),\"Hide\",\"Unhide\"))","v":"Hide"},"Opfattelig","Tidsafhængige medier","1.2.5","Synstolkning (forudindspillet)","Der skal leveres synstolkning til alt forudindspillet videoindhold i synkroniserede medier.","AA","Videoer kan afspilles med lydbeskrivelser.","Giv en synkroniseret talt beskrivelse af det visuelle indhold i videoer.","Folk, der ikke kan se eller forstå det visuelle indhold, kan høre om det, mens de afspiller videoer."]
[{"$f":"IF(LEN(Requirements_hidden!G8)>LEN(Question1),\"Hide\",\nIF(AND(COUNTIF(Questionnaire!$C$2:$M$43,Requirements_hidden!D8)>0,COUNTIF(Questionnaire!$C$2:$M$43,Requirements_hidden!D8)=COUNTIF(Questionnaire!$O$2:$Z$43,Requirements_hidden!D8)),\"Hide\",\"Unhide\"))","v":"Hide"},"Opfattelig","Tidsafhængige medier","1.2.6","Tegnsprog (forudindspillet)","Der skal leveres tegnsprogstolkning til alt forudindspillet lydindhold i synkroniserede medier.","AAA","Videoer kan ledsages af tegnsprog.","Giv tegnsprogstolkning til lydindhold i eksisterende videoer.","Døve eller hørehæmmede har flere måder at forstå multimedieindhold på."]
[{"$f":"IF(LEN(Requirements_hidden!G9)>LEN(Question1),\"Hide\",\nIF(AND(COUNTIF(Questionnaire!$C$2:$M$43,Requirements_hidden!D9)>0,COUNTIF(Questionnaire!$C$2:$M$43,Requirements_hidden!D9)=COUNTIF(Questionnaire!$O$2:$Z$43,Requirements_hidden!D9)),\"Hide\",\"Unhide\"))","v":"Hide"},"Opfattelig","Tidsafhængige medier","1.2.7","Udvidet synstolkning (forudindspillet)","I tilfælde, hvor pauserne i forgrundslyden ikke er tilstrækkeligt lange til at tillade synstolkning til formidling af videoens betydning, skal der leveres udvidet synstolkning til alt forudindspillet videoindhold i synkroniserede medier.","AAA","Videoer kan afspilles med mere detaljerede lydbeskrivelser.","Giv udvidede talte beskrivelser af det visuelle indhold i videoer.","Folk, der er blinde eller som ikke kan forstå det visuelle indhold, kan få det beskrevet for dem, mens de afspiller videoer."]
[{"$f":"IF(LEN(Requirements_hidden!G10)>LEN(Question1),\"Hide\",\nIF(AND(COUNTIF(Questionnaire!$C$2:$M$43,Requirements_hidden!D10)>0,COUNTIF(Questionnaire!$C$2:$M$43,Requirements_hidden!D10)=COUNTIF(Questionnaire!$O$2:$Z$43,Requirements_hidden!D10)),\"Hide\",\"Unhide\"))","v":"Hide"},"Opfattelig","Tidsafhængige medier","1.2.8","Mediealternativ (forudindspillet)","Der skal leveres et alternativ til alle forudindspillede synkroniserede medier samt alle forudindspillede rene videomedier.","AAA","Indspillede videoer kan forstås af flere mennesker.","Angiv en tekstækvivalent for alt indhold i videoer.","Flere mennesker, herunder dem, der er døvblinde, kan bedre forstå indholdet i deres eget tempo."]
[{"$f":"IF(LEN(Requirements_hidden!G11)>LEN(Question1),\"Hide\",\nIF(AND(COUNTIF(Questionnaire!$C$2:$M$43,Requirements_hidden!D11)>0,COUNTIF(Questionnaire!$C$2:$M$43,Requirements_hidden!D11)=COUNTIF(Questionnaire!$O$2:$Z$43,Requirements_hidden!D11)),\"Hide\",\"Unhide\"))","v":"Hide"},"Opfattelig","Tidsafhængige medier","1.2.9","Rent lydindhold (direkte)","Der skal leveres et alternativ til tidsafhængige medier, som præsenterer information, der svarer til den rene, direkte udsendte lyd.","AAA","Live lyd kan forstås af flere mennesker.","Angiv en tekstækvivalent til live-lydindhold.","Folk, der ikke kan høre eller forstå lyd i realtid, kan læse en tilsvarende."]
[{"$f":"IF(LEN(Requirements_hidden!G12)>LEN(Question1),\"Hide\",\nIF(AND(COUNTIF(Questionnaire!$C$2:$M$43,Requirements_hidden!D12)>0,COUNTIF(Questionnaire!$C$2:$M$43,Requirements_hidden!D12)=COUNTIF(Questionnaire!$O$2:$Z$43,Requirements_hidden!D12)),\"Hide\",\"Unhide\"))","v":"Hide"},"Opfattelig","Tilpasset","1.3.1","Information og relationer","Information, struktur, og relationer der formidles via præsentationen, kan bestemmes programmeringsmæssigt eller er tilgængelige som tekst.","A","Information om indholdsstruktur er tilgængelig for flere.","Brug kode til at forstærke relationer og information, der formidles gennem præsentation.","Folk kan tilpasse præsentationen, så den passer til deres behov, samtidig med at den oprindelige betydning bevares."]
[{"$f":"IF(LEN(Requirements_hidden!G13)>LEN(Question1),\"Hide\",\nIF(AND(COUNTIF(Questionnaire!$C$2:$M$43,Requirements_hidden!D13)>0,COUNTIF(Questionnaire!$C$2:$M$43,Requirements_hidden!D13)=COUNTIF(Questionnaire!$O$2:$Z$43,Requirements_hidden!D13)),\"Hide\",\"Unhide\"))","v":"Hide"},"Opfattelig","Tilpasset","1.3.2","Meningsfuld rækkefølge","Når den rækkefølge som indhold præsenteres i, påvirker indholdets mening, kan en korrekt læserækkefølge bestemmes programmeringsmæssigt.","A","Rækkefølgen af indhold kan forstås af flere mennesker.","Brug kode til at bevare meningsfuld indholdsrækkefølge.","Hjælpeteknologi kan præsentere indhold for brugerne i den rigtige rækkefølge."]
[{"$f":"IF(LEN(Requirements_hidden!G14)>LEN(Question1),\"Hide\",\nIF(AND(COUNTIF(Questionnaire!$C$2:$M$43,Requirements_hidden!D14)>0,COUNTIF(Questionnaire!$C$2:$M$43,Requirements_hidden!D14)=COUNTIF(Questionnaire!$O$2:$Z$43,Requirements_hidden!D14)),\"Hide\",\"Unhide\"))","v":"Hide"},"Opfattelig","Tilpasset","1.3.3","Sensoriske egenskaber","Instruktioner, der vedrører forståelse og betjening af indhold, er ikke udelukkende afhængige af komponenternes sensoriske egenskaber såsom form, størrelse, visuel placering, orientering eller lyd.","A","Instruktioner er forståelige for flere mennesker.","Beskriv kontrolelementer efter navn, ikke kun efter udseende eller placering.","Mennesker, der er blinde eller har nedsat syn, har brug for ikke-visuelle instruktioner."]
[{"$f":"IF(LEN(Requirements_hidden!G15)>LEN(Question1),\"Hide\",\nIF(AND(COUNTIF(Questionnaire!$C$2:$M$43,Requirements_hidden!D15)>0,COUNTIF(Questionnaire!$C$2:$M$43,Requirements_hidden!D15)=COUNTIF(Questionnaire!$O$2:$Z$43,Requirements_hidden!D15)),\"Hide\",\"Unhide\"))","v":"Hide"},"Opfattelig","Tilpasset","1.3.4","Retning","Indhold begrænser ikke sin visning eller anvendelse til en enkelt skærmretning, såsom lodret eller vandret, medmindre en bestemt skærmretning er nødvendig.","AA","Enheder kan bruges i enhver retning.","Lås ikke indhold til hverken stående eller liggende præsentation.","Kørestolsbrugere og andre kan have enheder monteret i en fast retning."]
{"$rows_left_out":65}
{"sheet":"Questionnaire","index":4,"n_rows":21,"n_cols":26,"rows_kept":21,"cut":false,"hidden":true,"merged":[]}
["Spørgsmål nr.","OBS! De krav der er oplistet i kolonne B og frem er de krav der skal scopes fra","Requirement IDs related to each question",null,null,null,null,null,null,null,null,null,null,null,"Shown IDs will be hidden from the requirements"]
[2,"Bruger løsningen videoindhold?","1.1.1","1.2.1","1.2.2","1.2.3","1.2.5","1.2.6","1.2.7",null,null,null,null,null,{"$f":"IF(Question2=\"Nej\",C2,\"\")","v":""},"","","","","","","",{"$f":"IF(Question2=\"Nej\",J2,\"\")","v":""},"","",""]
[3,"Bruger løsningen lydindhold?","1.1.1","1.2.1","1.2.2","1.2.3","1.4.2","1.4.7",null,null,null,null,null,null,{"$f":"IF(Question3=\"Nej\",C3,\"\")","v":""},"","","","","","","",{"$f":"IF(Question3=\"Nej\",J3,\"\")","v":""},"","",""]
[4,"Inkluderer løsningen live streaming eller webcasts?","1.2.4","1.2.9",null,null,null,null,null,null,null,null,null,null,{"$f":"IF(Question4=\"Nej\",C4,\"\")","v":""},"","","","","","","",{"$f":"IF(Question4=\"Nej\",J4,\"\")","v":""},"","",""]
[5,"Indeholder løsningen billeder med tekst indhold?","1.4.3","1.4.4","1.4.5","1.4.6","1.4.9",null,null,null,null,null,null,null,{"$f":"IF(Question5=\"Nej\",C5,\"\")","v":""}]
[6,"Indeholder løsningen formularer, som brugerne skal udfylde?","1.3.3","1.3.5","3.3.1","4.1.2",null,null,null,null,null,null,null,null,{"$f":"IF(Question6=\"Nej\",C6,\"\")","v":""},"","","","","","","","","","",""]
[7,"Benytter løsningen tekst?","1.3.2","1.4.3","1.4.4","1.4.6","1.4.8","2.4.6","2.4.10","3.1.1","3.1.2",null,null,null,{"$f":"IF(Question7=\"Nej\",C7,\"\")","v":""},"","","","","","","","","","",""]
[8,"Benytter løsningen ikke-tekstindhold (f.eks. billeder, ikoner)?","1.4.1","1.4.3","2.3.3","2.5.3",null,null,null,null,null,null,null,null,{"$f":"IF(Question8=\"Nej\",C8,\"\")","v":""},"","","","","","","","","","",""]
[9,"Benytter løsningen farve til at formidle information?","1.4.1",null,null,null,null,null,null,null,null,null,null,null,{"$f":"IF(Question9=\"Nej\",C9,\"\")","v":""},"","","","","","","","","","",""]
[10,"Kan løsningen bruges på mobile enheder (Smartphones og tablets)?","1.3.4","2.5.4",null,null,null,null,null,null,null,null,null,null,{"$f":"IF(Question10=\"Nej\",C10,\"\")","v":""},"","","","","","","",{"$f":"IF(Question10=\"Nej\",J10,\"\")","v":""},{"$f":"IF(Question10=\"Nej\",K10,\"\")","v":""},{"$f":"IF(Question10=\"Nej\",L10,\"\")","v":""},{"$f":"IF(Question10=\"Nej\",M10,\"\")","v":""}]
[11,"Har løsningen tidsbegrænsninger for brugerhandlinger?","2.2.1","2.2.3","2.2.4","2.2.5","2.2.6",null,null,null,null,null,null,null,{"$f":"IF(Question11=\"Nej\",C11,\"\")","v":""},"","","","","","","",{"$f":"IF(Question11=\"Nej\",J11,\"\")","v":""},{"$f":"IF(Question11=\"Nej\",K11,\"\")","v":""},{"$f":"IF(Question11=\"Nej\",L11,\"\")","v":""},{"$f":"IF(Question11=\"Nej\",M11,\"\")","v":""}]
[12,"Indeholder løsningen indhold, der bevæger sig, blinker eller opdateres automatisk?","2.2.2","2.3.1","2.3.2",null,null,null,null,null,null,null,null,null,{"$f":"IF(Question12=\"Nej\",D12,\"\")","v":""},"","","","","","","",{"$f":"IF(Question12=\"Nej\",J12,\"\")","v":""},{"$f":"IF(Question12=\"Nej\",K12,\"\")","v":""},{"$f":"IF(Question12=\"Nej\",L12,\"\")","v":""},{"$f":"IF(Question12=\"Nej\",M12,\"\")","v":""}]
[13,"Indeholder løsningen indehold som kræver instruktioner?","1.3.3","1.4.1","3.3.2","3.3.5",null,null,null,null,null,null,null,null,{"$f":"IF(Question13=\"Nej\",C13,\"\")","v":""},"","","","","","","","",{"$f":"IF(Question13=\"Nej\",K13,\"\")","v":""},{"$f":"IF(Question13=\"Nej\",L13,\"\")","v":""},{"$f":"IF(Question13=\"Nej\",M13,\"\")","v":""}]
[14,"Undersøtter løsningen brugerinput?","2.5.6","3.2.2","3.2.5","3.3.2","3.3.3",null,null,null,null,null,null,null,{"$f":"IF(Question14=\"Nej\",C14,\"\")","v":""},"","","","","","","","",{"$f":"IF(Question14=\"Nej\",K14,\"\")","v":""},{"$f":"IF(Question14=\"Nej\",L14,\"\")","v":""},{"$f":"IF(Question14=\"Nej\",M14,\"\")","v":""}]
[15,"Indeholder løsningen links?","2.4.4","2.4.9","4.1.2",null,null,null,null,null,null,null,null,null,{"$f":"IF(Question15=\"Nej\",C15,\"\")","v":""},"","","","","","","","",{"$f":"IF(Question15=\"Nej\",K15,\"\")","v":""},{"$f":"IF(Question15=\"Nej\",L15,\"\")","v":""},{"$f":"IF(Question15=\"Nej\",M15,\"\")","v":""}]
{"$rows_left_out":7}
{"sheet":"Hjælp","index":5,"n_rows":23,"n_cols":2,"rows_kept":23,"cut":false,"hidden":false,"merged":[]}
["Regnearket indeholder **WCAG-overensstemmelsesspørgeskemaet**."]
["Nr. ","Spørgsmål"]
[1,"Hvilket niveau af overholdelse af WCAG-krav skal imødekommes?\n*AA = Adresserer de mest almindelige barrierer. Sigter mod at gøre indhold tilgængeligt for et bredere publikum. **AAA (højeste niveau) = Højeste niveau af tilgængelighed. Sikrer, at indhold er tilgængeligt for det størst mulige antal personer, herunder personer med alvorlige handicap."]
[2,"Bruger løsningen videoindhold?"]
[3,"Bruger løsningen lydindhold?"]
[4,"Inkluderer løsningen live streaming* eller webcasts**?\n*Det er muligt at sende video og lyd direkte over internettet i realtid, så seerne kan følge med, mens det sker.\n** Online udsendelser, der kan være enten live eller optaget, og som distribueres over internettet til et bredt publikum. Webcasts kan indeholde video, lyd og præsentationer."]
[5,"Indeholder løsningen billeder med tekst indhold?"]
[6,"Indeholder løsningen formularer, som brugerne skal udfylde?"]
[7,"Benytter løsningen tekst?"]
[8,"Benytter løsningen ikke-tekstindhold (f.eks. billeder, ikoner)?"]
[9,"Benytter løsningen farve til at formidle information?\nFarver kan være et effektivt værktøj til at formidle information, især når det kommer til datavisualisering og design.\n\nEksempel: Trafiklysdiagram er en almindelig metode til at bruge farver til at formidle information hurtigt og intuitivt. \nRød: Indikerer en kritisk eller problematisk status, hvor der er behov for øjeblikkelig handling eller opmærksomhed.\nGul: Signalerer en advarsel eller et område, der kræver overvågning, men som ikke er kritisk.\nGrøn: Viser, at alt er i orden, og der er ingen problemer."]
[10,"Kan løsningen bruges på mobile enheder (Smartphones og tablets)?"]
[11,"Har løsningen *tidsbegrænsninger for brugerhandlinger?\n*Ved tidsbegrænsninger referes til den tid en bruger har til at fuldføre en opgave eller interaktion på en hjemmeside eller webapplikation."]
[12,"Indeholder løsningen indhold, der bevæger sig, blinker eller opdateres automatisk?"]
[13,"Indeholder løsningen indehold som kræver *instruktioner?\nInstruktioner i konteksten af webtilgængelighed er vejledninger, der hjælper brugere med at forstå og interagere med indholdet på en hjemmeside eller webapplikation. \n\nEksempel: \"Udfyld alle felter markeret med en stjerne (*), da de er obligatoriske.\""]
{"$rows_left_out":9}
{"sheet":"Level of Conformance","index":6,"n_rows":7,"n_cols":3,"rows_kept":7,"cut":false,"hidden":true,"merged":[]}
[]
["Level",null,": Essential accessibility features. Without these, some users cannot access content."]
["Level","AA",": Addresses the most common barriers. Aims to make content accessible to a broader audience."]
["Level","AAA",": Highest level of accessibility. Ensures content is accessible to the maximum number of people, including those with severe disabilities."]
[]
[null,"Ja "]
[null,"Nej"]

{"sheet":"Requirements","index":7,"n_rows":79,"n_cols":7,"rows_kept":79,"cut":false,"hidden":true,"merged":[]}
["Principper","Retningslinjer","Nr.","Succeskriterier","Beskrivelse","Level ","Examples"]
["Opfattelig","Tekstbaserede alternativer","1.1.1","Ikke-tekstbaseret indhold","Alt ikke-tekstbaseret indhold, der præsenteres for brugeren, har tilknyttet et tekstbaseret alternativ, som har samme formål, undtaget nedenstående situationer.","A"]
["Opfattelig","Tidsafhængige medier","1.2.1","Rent lydindhold (audio only) og rent videoindhold (video only) (forudindspillet)","For forudindspillet rent lydindhold og forudindspillet rent videoindhold gælder følgende, undtagen når video eller lyd udgør et mediealternativ til tekst og klart er markeret som sådan","A"]
["Opfattelig","Tidsafhængige medier","1.2.2","Undertekster (forudindspillet)","Der skal leveres undertekster til alt forudindspillet lydindhold i synkroniserede medier, undtaget når medier fungerer som mediealternativ til tekst og er klart markeret som sådan.","A"]
["Opfattelig","Tidsafhængige medier","1.2.3","Synstolkning eller mediealternativ (forudindspillet)","Der skal leveres et alternativ til tidsafhængige medier eller synstolkning af forudindspillet/ videoindhold i synkroniserede medier, undtagen når medierne er mediealternativ til tekst og er klart markeret som sådan.","A"]
["Opfattelig","Tidsafhængige medier","1.2.4","Undertekster (direkte)","Der skal leveres undertekster til alt direkte udsendt lydindhold i synkroniserede medier","AA"]
["Opfattelig","Tidsafhængige medier","1.2.5","Synstolkning (forudindspillet)","Der skal leveres synstolkning til alt forudindspillet videoindhold i synkroniserede medier.","AA"]
["Opfattelig","Tidsafhængige medier","1.2.6","Tegnsprog (forudindspillet)","Der skal leveres tegnsprogstolkning til alt forudindspillet lydindhold i synkroniserede medier.","AAA"]
["Opfattelig","Tidsafhængige medier","1.2.7","Udvidet synstolkning (forudindspillet)","I tilfælde, hvor pauserne i forgrundslyden ikke er tilstrækkeligt lange til at tillade synstolkning til formidling af videoens betydning, skal der leveres udvidet synstolkning til alt forudindspillet videoindhold i synkroniserede medier.","AAA"]
["Opfattelig","Tidsafhængige medier","1.2.8","Mediealternativ (forudindspillet)","Der skal leveres et alternativ til alle forudindspillede synkroniserede medier samt alle forudindspillede rene videomedier.","AAA"]
["Opfattelig","Tidsafhængige medier","1.2.9","Rent lydindhold (direkte)","Der skal leveres et alternativ til tidsafhængige medier, som præsenterer information, der svarer til den rene, direkte udsendte lyd.","AAA"]
["Opfattelig","Tilpasset","1.3.1","Information og relationer","Information, struktur, og relationer der formidles via præsentationen, kan bestemmes programmeringsmæssigt eller er tilgængelige som tekst.","A"]
["Opfattelig","Tilpasset","1.3.2","Meningsfuld rækkefølge","Når den rækkefølge som indhold præsenteres i, påvirker indholdets mening, kan en korrekt læserækkefølge bestemmes programmeringsmæssigt.","A"]
["Opfattelig","Tilpasset","1.3.3","Sensoriske egenskaber","Instruktioner, der vedrører forståelse og betjening af indhold, er ikke udelukkende afhængige af komponenternes sensoriske egenskaber såsom form, størrelse, visuel placering, orientering eller lyd.","A"]
["Opfattelig","Tilpasset","1.3.4","Retning","Indhold begrænser ikke sin visning eller anvendelse til en enkelt skærmretning, såsom lodret eller vandret, medmindre en bestemt skærmretning er nødvendig.","AA"]
{"$rows_left_out":64}